Error 215 Assertion Failed Ssize Empty In Function Cv Resize Cv2 Error Information Guide

  1. Introduction to Error 215 Assertion Failed Ssize Empty In Function Cv Resize Cv2 Error
  2. Core Information
  3. Developments
  4. Detailed Analysis
  5. Conclusion

Introduction to Error 215 Assertion Failed Ssize Empty In Function Cv Resize Cv2 Error

error: (-215:Assertion failed) !ssize.empty() in function 'cv::resize' | cv2.error Update
Looking for the latest information on Error 215 Assertion Failed Ssize Empty In Function Cv Resize Cv2 Error? We've researched comprehensive data, records, and insights about Error 215 Assertion Failed Ssize Empty In Function Cv Resize Cv2 Error.

Core Information

Information (Solution)cv2.error: error: (-215:Assertion failed) !_src.empty() in function 'cv::cvtColor' Guide
Explore the main sources for Error 215 Assertion Failed Ssize Empty In Function Cv Resize Cv2 Error.

Developments

Full cv2.error: OpenCV(4.5.5) error: (-215:Assertion failed) !_img.empty() in function 'cv::imwrite' Update
Stay updated on Error 215 Assertion Failed Ssize Empty In Function Cv Resize Cv2 Error's newest achievements.

PYTHON : error: (-215) !empty() in function detectMultiScale
PYTHON : error: (-215) !empty() in function detectMultiScale
PYTHON : OpenCV resize fails on large image with error: (-215) ssize.area()   0 in function cv::res
PYTHON : OpenCV resize fails on large image with error: (-215) ssize.area() 0 in function cv::res
error: (-215:Assertion failed) size.width>0 && size.height>0 in function 'cv::imshow' |cv2.error
error: (-215:Assertion failed) size.width>0 && size.height>0 in function 'cv::imshow' |cv2.error
cv2.error: error: (-215:Assertion failed) !_src.empty() in function 'cv::cvtColor'
cv2.error: error: (-215:Assertion failed) !_src.empty() in function 'cv::cvtColor'
error:(-215:Assertion failed) size.width0 && size.height0 in function 'cv::imshow' SOLVED in opencv
error:(-215:Assertion failed) size.width0 && size.height0 in function 'cv::imshow' SOLVED in opencv
error: (-215:Assertion failed) !empty() in function 'cv::CascadeClassifier::detectMultiScale
error: (-215:Assertion failed) !empty() in function 'cv::CascadeClassifier::detectMultiScale
error: (-215:Assertion failed) size.width>0 && size.height>0 in function 'cv::imshow' |cv2.error
error: (-215:Assertion failed) size.width>0 && size.height>0 in function 'cv::imshow' |cv2.error
PYTHON : error: (-215) !empty() in function detectMultiScale
PYTHON : error: (-215) !empty() in function detectMultiScale
(SOLVED) Error Assertion failed ! src empty in Function  cv: cvtColor | Python error | cv2 Module
(SOLVED) Error Assertion failed ! src empty in Function cv: cvtColor | Python error | cv2 Module
100% resolved imshow | (-215: Assertion Failed) size.width && size.height in function 'cv::imshow'
100% resolved imshow | (-215: Assertion Failed) size.width && size.height in function 'cv::imshow'
error: (-215:Assertion failed) src.type() == CV_8UC1 in function 'cv::adaptiveThreshold'
error: (-215:Assertion failed) src.type() == CV_8UC1 in function 'cv::adaptiveThreshold'

Detailed Analysis

Data is compiled from public records and verified media reports.

Last Updated: September 21, 2026

Conclusion

Information error: (-215:Assertion failed) !_src.empty() in function 'cv::cvtColor' SOLVED in opencv Update
For 2026, Error 215 Assertion Failed Ssize Empty In Function Cv Resize Cv2 Error remains one of the most searched-for information profiles. Check back for the newest reports.

Disclaimer: Disclaimer: All information is compiled from publicly available data, media reports, and analysis. Actual details may vary.

Summary

error215Assertionfailedssizeemptyinfunctioncvresize I am fresher youtuber Sorry for my mistakes. If you have any query here, I will reply you. Thank you.

Error 215 Assertion Failed Ssize Empty In Function Cv Resize Cv2 Error.pdf

Size: 3.23 MB · Format: PDF · Secure Download

Download PDF Read Online

Frequently Asked Questions

What is the most accurate information about Error 215 Assertion Failed Ssize Empty In Function Cv Resize Cv2 Error?

Our platform aggregates the most comprehensive and up-to-date insights, ensuring you get relevant details about Error 215 Assertion Failed Ssize Empty In Function Cv Resize Cv2 Error.

Why is Error 215 Assertion Failed Ssize Empty In Function Cv Resize Cv2 Error trending right now?

Interest in Error 215 Assertion Failed Ssize Empty In Function Cv Resize Cv2 Error has surged recently as more people seek reliable resources, related media, and detailed analysis.

Where can I find related media and updates for Error 215 Assertion Failed Ssize Empty In Function Cv Resize Cv2 Error?

You can explore extensive galleries, video summaries, and related content directly on this page.

How often is the content about Error 215 Assertion Failed Ssize Empty In Function Cv Resize Cv2 Error updated?

We regularly update our database with the latest information, media, and analysis related to Error 215 Assertion Failed Ssize Empty In Function Cv Resize Cv2 Error.

Related Documents

Popular Topics

Unlock Uocb Academic Schedule And Plan Your Degree Success Carrd Tutorial Build A Multi Page Website In Minutes Using This One Simple Trick Matplotlib Oscilloscope How Does A Doppler Weather Radar Work Decoding The Us 10 Year Treasury Yield For Beginners Stay Organized With Ugas Official Academic Calendar The Ultimate Guide To Army Pay Scale Benefits Navigating Beltrami County Court Docket Information Online Expert Advice For Selecting The Perfect Matplotlib Colour Scheme For Your Next Project Colorado Business Owners Dont Let Revenue Decline Catch You Javascripttutorial Access Multi Dimensional Arrays With Indexes Avoiding Overpaying Taxes How An Nc Payroll Calculator Works Freedom Of Information Law Information Session 4 16 2026 February 9 2026 Regular School Board Meeting Hexadecimal Hacks Revealed The Ultimate Rgb Color Conversion Blueprint