Overview to Error Execution Failed For Task App Checkdebugduplicateclasses
Looking for the latest information on Error Execution Failed For Task App Checkdebugduplicateclasses? We've gathered comprehensive data, records, and insights about Error Execution Failed For Task App Checkdebugduplicateclasses.
Key Details
Explore the main sources for Error Execution Failed For Task App Checkdebugduplicateclasses.
History
Stay updated on Error Execution Failed For Task App Checkdebugduplicateclasses's latest milestones.
Fix for 'Execution failed for task :app:mapDebugSourceSetPaths' Error in Flutter & Firebase
Execution failed for task ':app:compileDebugKotlin' in Android Studio || Flutter || ERROR SOLVED ✅
FAILURE: Build failed with an exception | Execution failed for task ':app:processDebugManifest' |
How to fix Execution failed for task ':app:compileDebugKotlin' | jvm target compatibility error.
[Solved] Error:Execution failed for task ':app:compileDebugAidl'. aidl is missing Android Studio
Execution failed for task ':app:checkDebugDuplicateClasses || 2024
Execution failed for task ':app:checkDebugAarMetadata'. | Android Studio Error Fixed | Error Resolve
Execution failed for task ':app:checkDebugDuplicateClasses'
[SOLVED] Execution Failed for Task ':app:kaptDebugKotlin' – Fix Android Studio Build Error FAST!
Android : Error:Execution failed for task ':app:kaptDebugKotlin'
learn flutter, What went wrong: Execution failed for task ':app:checkDebugDuplicateClasses'.
Detailed Analysis
Data is compiled from public records and verified media reports.
Last Updated: September 21, 2026
Final Thoughts
For 2026, Error Execution Failed For Task App Checkdebugduplicateclasses remains one of the most searched-for information profiles. Check back for the newest reports.
Disclaimer: Disclaimer: All information is compiled from publicly available data, media reports, and analysis. Actual details may vary.
Summary
Learn how to fix the common `Flutter configurations{ all*.exclude group:'com.google.guava', module: 'listenablefuture' } In this tutorial, we'll tackle the common Android Studio build If This Video Helped You, Please My Channel Thank You For Watching. Solution for Kotlin project compilation Android studio common error when we run new Android project on Updated version so here is Error: Execution failed for task ... الله يسعدكم وصلوا على النبي واشتراك في القناة FAILURE: Build failed with an exception. * What went wrong: Having trouble with the dreaded : learn flutter and android. FAILURE: Build failed with an exception. * What went wrong:
Error Execution Failed For Task App Checkdebugduplicateclasses.pdf
What is the most accurate information about Error Execution Failed For Task App Checkdebugduplicateclasses?
Our platform aggregates the most comprehensive and up-to-date insights, ensuring you get relevant details about Error Execution Failed For Task App Checkdebugduplicateclasses.
Why is Error Execution Failed For Task App Checkdebugduplicateclasses trending right now?
Interest in Error Execution Failed For Task App Checkdebugduplicateclasses has surged recently as more people seek reliable resources, related media, and detailed analysis.
Where can I find related media and updates for Error Execution Failed For Task App Checkdebugduplicateclasses?
You can explore extensive galleries, video summaries, and related content directly on this page.
How often is the content about Error Execution Failed For Task App Checkdebugduplicateclasses updated?
We regularly update our database with the latest information, media, and analysis related to Error Execution Failed For Task App Checkdebugduplicateclasses.