Error Node Modules Node Sass Command Failed Exit Code 1 Command Node Scripts Build Js Node Js Information Guide

  1. Introduction on Error Node Modules Node Sass Command Failed Exit Code 1 Command Node Scripts Build Js Node Js
  2. Important Facts
  3. Recent Updates
  4. Full Guide
  5. Final Thoughts

Introduction on Error Node Modules Node Sass Command Failed Exit Code 1 Command Node Scripts Build Js Node Js

Full error node_modules/node-sass: Command failed Exit code: 1 Command: node scripts/build.js node js News
Looking for the latest information on Error Node Modules Node Sass Command Failed Exit Code 1 Command Node Scripts Build Js Node Js? We've researched comprehensive data, records, and insights about Error Node Modules Node Sass Command Failed Exit Code 1 Command Node Scripts Build Js Node Js.

Important Facts

Information NodeJS : error /node_modules/node-sass: Command failed Guide
Explore the main sources for Error Node Modules Node Sass Command Failed Exit Code 1 Command Node Scripts Build Js Node Js.

Recent Updates

Details NodeJS : ERROR in ./src/styles.scss .. Module build failed: Error: Cannot find module 'node-sass' News
Stay updated on Error Node Modules Node Sass Command Failed Exit Code 1 Command Node Scripts Build Js Node Js's latest milestones.

npm Error Failed at the node-sass@4.9.0 install script (2 Solutions!!)
npm Error Failed at the node-sass@4.9.0 install script (2 Solutions!!)
NodeJS : Getting errors while installing node-sass
NodeJS : Getting errors while installing node-sass
NodeJS : Cannot install node-sass npm module
NodeJS : Cannot install node-sass npm module
Cannot find module node-sass error on npm run dev
Cannot find module node-sass error on npm run dev
How to Fix Need to Install node-sass Error in Create React App
How to Fix Need to Install node-sass Error in Create React App
NodeJS : node-sass installation issue
NodeJS : node-sass installation issue
NodeJS : Node-sass, node-gyp errors, how to fix
NodeJS : Node-sass, node-gyp errors, how to fix
NodeJS : Node-sass is not recognized by command line
NodeJS : Node-sass is not recognized by command line
NodeJS : Installing npm node-sass
NodeJS : Installing npm node-sass
NodeJS : NPM Error When Trying To Install node-sass
NodeJS : NPM Error When Trying To Install node-sass
NodeJS : npm ERR! gyp ERR! when installing node sass in windows 11 with Visual Studio 2022 Enterpris
NodeJS : npm ERR! gyp ERR! when installing node sass in windows 11 with Visual Studio 2022 Enterpris

Full Guide

Data is compiled from public records and verified media reports.

Last Updated: September 22, 2026

Final Thoughts

Information ERROR in Cannot find module 'node-sass' npm install node-sass node js Guide
For 2026, Error Node Modules Node Sass Command Failed Exit Code 1 Command Node Scripts Build Js Node Js remains one of the most searched-for information profiles. Check back for the newest reports.

Disclaimer: Disclaimer: All information is compiled from publicly available data, media reports, and analysis. Actual details may vary.

Summary

Arguments: Directory: node_modules/ amzn.to/4aLHbLD You're literally one away from a better setup — grab it now! As an Amazon Associate I earn ... Summary: Learn how to resolve the 'Need to Install

Error Node Modules Node Sass Command Failed Exit Code 1 Command Node Scripts Build Js Node Js.pdf

Size: 1.51 MB · Format: PDF · Secure Download

Download PDF Read Online

Frequently Asked Questions

What is the most accurate information about Error Node Modules Node Sass Command Failed Exit Code 1 Command Node Scripts Build Js Node Js?

Our platform aggregates the most comprehensive and up-to-date insights, ensuring you get relevant details about Error Node Modules Node Sass Command Failed Exit Code 1 Command Node Scripts Build Js Node Js.

Why is Error Node Modules Node Sass Command Failed Exit Code 1 Command Node Scripts Build Js Node Js trending right now?

Interest in Error Node Modules Node Sass Command Failed Exit Code 1 Command Node Scripts Build Js Node Js has surged recently as more people seek reliable resources, related media, and detailed analysis.

Where can I find related media and updates for Error Node Modules Node Sass Command Failed Exit Code 1 Command Node Scripts Build Js Node Js?

You can explore extensive galleries, video summaries, and related content directly on this page.

How often is the content about Error Node Modules Node Sass Command Failed Exit Code 1 Command Node Scripts Build Js Node Js updated?

We regularly update our database with the latest information, media, and analysis related to Error Node Modules Node Sass Command Failed Exit Code 1 Command Node Scripts Build Js Node Js.

Related Documents

Popular Topics

Philadelphia Docket Search Essentials For Beginners Unique Father's Day Poem Printable Ideas For A Special Dad Hidden Benefits Of Using A Depo Calendar In Your Business Unlock Efficient Piano Learning With Labeled Keyboard Notes Tamil Calendar For USA: A Beginner's Essential Guide To Understanding Festival Dates Unlocking Success With Humble ISD Academic Calendar And Events Michigan Football Roster Breakdown: What To Expect This Season Avoid Overloading In Mizzou's Packed Academic Schedule Crack The Code Fortune Telling Crossword Clue Solutions Revealed Unlock Washington Post Daily Crossword Puzzles Free Online Today Avoid Common Mistakes In John Deere ESS Adoption A Complete Beginner's Guide To Colorado Peak Login Inflation Trends In The US - A Decade-by-Decade Analysis Maximizing Efficiency With Integrated Pps And Trello Calendars Maximizing Fun With Your Secret Sister Questionnaire Gift Exchange