Fix App Store Upload Error Hermes Framework Contains Bitcode React Native Ios Build Failed Information Guide

  1. Background to Fix App Store Upload Error Hermes Framework Contains Bitcode React Native Ios Build Failed
  2. Key Details
  3. History
  4. Expert Insights
  5. Future Outlook

Background to Fix App Store Upload Error Hermes Framework Contains Bitcode React Native Ios Build Failed

Information Fix App Store Upload Error | Hermes.framework Contains Bitcode | React Native iOS Build Failed Guide
Looking for the latest information on Fix App Store Upload Error Hermes Framework Contains Bitcode React Native Ios Build Failed? We've researched comprehensive data, records, and insights about Fix App Store Upload Error Hermes Framework Contains Bitcode React Native Ios Build Failed.

Key Details

Fixing React Native iOS Build Error: node: No such file or directory in PhaseScriptExecution News
Explore the key sources for Fix App Store Upload Error Hermes Framework Contains Bitcode React Native Ios Build Failed.

History

Information Fixing iOS Production Build Crashes in React Native Apps with Expo Update
Stay updated on Fix App Store Upload Error Hermes Framework Contains Bitcode React Native Ios Build Failed's latest milestones.

Fix Bitcode Errors in Xcode 16 | How to Solve Invalid Executable When Uploading iOS Builds
Fix Bitcode Errors in Xcode 16 | How to Solve Invalid Executable When Uploading iOS Builds
How to Fix MMKV v4 iOS Build Errors in 2 Minutes
How to Fix MMKV v4 iOS Build Errors in 2 Minutes
Invalid Executable. The executable 'appname.app/Frameworks/hermes.framework/hermes' contains bitcode
Invalid Executable. The executable 'appname.app/Frameworks/hermes.framework/hermes' contains bitcode
error Failed to build iOS project We ran xcodebuild command but it exited with error code 65
error Failed to build iOS project We ran xcodebuild command but it exited with error code 65
Fix Xcode Missing Assets Error | Create iOS App Icons & Upload to App Store
Fix Xcode Missing Assets Error | Create iOS App Icons & Upload to App Store
How to Fix the Build Input File Cannot Be Found Error in React Native with Xcode
How to Fix the Build Input File Cannot Be Found Error in React Native with Xcode
Resolved: Failed to build iOS app error ** BUILD FAILED ** Could not build the app for the simulator
Resolved: Failed to build iOS app error ** BUILD FAILED ** Could not build the app for the simulator
How to Enable Hermes Debugging in Expo React Native iOS Projects
How to Enable Hermes Debugging in Expo React Native iOS Projects
[Fixed] xcodebuild: error: Could not resolve package dependencies | React Native | Xcode | iOS
[Fixed] xcodebuild: error: Could not resolve package dependencies | React Native | Xcode | iOS
App Store Connect TestFlight Build Is Stuck on Processing – How to Fix
App Store Connect TestFlight Build Is Stuck on Processing – How to Fix
'No bundle URL present'  error in react native ios build
'No bundle URL present' error in react native ios build

Expert Insights

Data is compiled from public records and verified media reports.

Last Updated: September 21, 2026

Future Outlook

Information Xcode Says “Uploaded to Apple” but No Build in App Store Fix This Hidden Issue! XlSheet AI App Update
For 2026, Fix App Store Upload Error Hermes Framework Contains Bitcode React Native Ios Build Failed remains one of the most searched-for information profiles. Check back for the newest reports.

Disclaimer: Disclaimer: All information is compiled from publicly available data, media reports, and analysis. Actual details may vary.

Summary

code start ---- bitcode_strip_path = `xcrun --find bitcode_strip`.chop! def strip_bitcode_from_framework(bitcode_strip_path, ... Learn how to resolve the common Discover how to resolve the issue of ` Stuck in the loop where Xcode shows “ YouTube Description Struggling with Invalid Executable. The executable 'appname. Learn how to properly configure

Fix App Store Upload Error Hermes Framework Contains Bitcode React Native Ios Build Failed.pdf

Size: 4.28 MB · Format: PDF · Secure Download

Download PDF Read Online

Frequently Asked Questions

What is the most accurate information about Fix App Store Upload Error Hermes Framework Contains Bitcode React Native Ios Build Failed?

Our platform aggregates the most comprehensive and up-to-date insights, ensuring you get relevant details about Fix App Store Upload Error Hermes Framework Contains Bitcode React Native Ios Build Failed.

Why is Fix App Store Upload Error Hermes Framework Contains Bitcode React Native Ios Build Failed trending right now?

Interest in Fix App Store Upload Error Hermes Framework Contains Bitcode React Native Ios Build Failed has surged recently as more people seek reliable resources, related media, and detailed analysis.

Where can I find related media and updates for Fix App Store Upload Error Hermes Framework Contains Bitcode React Native Ios Build Failed?

You can explore extensive galleries, video summaries, and related content directly on this page.

How often is the content about Fix App Store Upload Error Hermes Framework Contains Bitcode React Native Ios Build Failed updated?

We regularly update our database with the latest information, media, and analysis related to Fix App Store Upload Error Hermes Framework Contains Bitcode React Native Ios Build Failed.

Related Documents

Popular Topics

Writing Numbers 6 10 Explore Learning Kindergarten Numbers 70 Custom Exceptions In Python Python Tutorial Good Vs Bad Security Camera Installations Expert Cctv Breakdown Health Insurance Explained Understanding The Differences Between String Stringbuffer And Stringbuilder In Java Discover The Power Of Cvc Pictures And Words In Phonics Cnn Democratic Debate Open Night 1 2025 100 000 Keswick Stakes At Colonial Downs Elevate Your Bathroom Style With Printable Wall Signs Configuration And Setup 20 How To Implement A Debounce Function In Javascript Data And Identity In Data Cloud Unit 1 To 5 29 Why Time Management Isnt Fixing The Always Behind Feeling In Real Estate Fix Php Code Error Problem In Printing Php Code Can T Run Server Error Php Not Work Php Error Complex Sentence