Mergedexdebug Failed Dex File Build Error In React Native Information Guide

  1. About to Mergedexdebug Failed Dex File Build Error In React Native
  2. Core Information
  3. Developments
  4. Full Guide
  5. Final Thoughts

About to Mergedexdebug Failed Dex File Build Error In React Native

Information Mergedexdebug failed dex file build error in react native Guide
Looking for the latest information on Mergedexdebug Failed Dex File Build Error In React Native? We've gathered comprehensive data, records, and insights about Mergedexdebug Failed Dex File Build Error In React Native.

Core Information

Details mergeDexDebug FAILED | Dex file build error in react native News
Explore the primary sources for Mergedexdebug Failed Dex File Build Error In React Native.

Developments

How to Fix Execution failed for task :app:stripDebugDebugSymbols Error in React Native Update
Stay updated on Mergedexdebug Failed Dex File Build Error In React Native's newest achievements.

How to Fix 'Execution Failed for Task:app:checkDebugAarMetadata' in React Native Project
How to Fix 'Execution Failed for Task:app:checkDebugAarMetadata' in React Native Project
app mergeDexDebug Errors
app mergeDexDebug Errors
error message : Task :app:installDebug FAILED | React Native Errors | Fixed!
error message : Task :app:installDebug FAILED | React Native Errors | Fixed!
[Fixed] Gradle build failed with unknown error in Expo/React Native
[Fixed] Gradle build failed with unknown error in Expo/React Native
Fixing Gradle build failed Error in React Native with EAS Build for Android
Fixing Gradle build failed Error in React Native with EAS Build for Android
Android : Execution failed for task ':app:mergeDebugNativeLibs'. in react native
Android : Execution failed for task ':app:mergeDebugNativeLibs'. in react native
Fixing React Native iOS Build Error: node: No such file or directory in PhaseScriptExecution
Fixing React Native iOS Build Error: node: No such file or directory in PhaseScriptExecution
Task: react-native-async-storage_async-storage generateDebugRFile FAILED verifyReleaseResources
Task: react-native-async-storage_async-storage generateDebugRFile FAILED verifyReleaseResources
Error on Task apptransformDexArchiveWithExternalLibsDexMergerForDebug FAILED in react-native-maps
Error on Task apptransformDexArchiveWithExternalLibsDexMergerForDebug FAILED in react-native-maps
Fix Gradle Errors in React Native | Step-by-Step Guide
Fix Gradle Errors in React Native | Step-by-Step Guide
Android : How to fix Execution failed for task ':app:processDebugManifest' in React Native
Android : How to fix Execution failed for task ':app:processDebugManifest' in React Native

Full Guide

Data is compiled from public records and verified media reports.

Last Updated: September 22, 2026

Final Thoughts

Information How to Fix Execution failed for task :app:stripDebugDebugSymbols Error in React Native Guide
For 2026, Mergedexdebug Failed Dex File Build Error In React Native remains one of the most talked-about information profiles. Check back for the latest updates.

Disclaimer: Disclaimer: All information is compiled from publicly available data, media reports, and analysis. Actual details may vary.

Summary

Here you will see how to fix mergeDex Debug Android app (APK) files contain executable bytecode files in the form of Dalvik Executable ( Learn how to resolve the `Execution Summary: Struggling with 'Execution Facing Gradle issues while working with

Mergedexdebug Failed Dex File Build Error In React Native.pdf

Size: 1.69 MB · Format: PDF · Secure Download

Download PDF Read Online

Frequently Asked Questions

What is the most accurate information about Mergedexdebug Failed Dex File Build Error In React Native?

Our platform aggregates the most comprehensive and up-to-date insights, ensuring you get relevant details about Mergedexdebug Failed Dex File Build Error In React Native.

Why is Mergedexdebug Failed Dex File Build Error In React Native trending right now?

Interest in Mergedexdebug Failed Dex File Build Error In React Native has surged recently as more people seek reliable resources, related media, and detailed analysis.

Where can I find related media and updates for Mergedexdebug Failed Dex File Build Error In React Native?

You can explore extensive galleries, video summaries, and related content directly on this page.

How often is the content about Mergedexdebug Failed Dex File Build Error In React Native updated?

We regularly update our database with the latest information, media, and analysis related to Mergedexdebug Failed Dex File Build Error In React Native.

Related Documents

Popular Topics

Beginner's Complete Guide To Understanding 1040 Tax Form Basics Crime Rates And Safety In Sheridan Colorado County Analyzed Aurora CO DMV Wait Times - Insider Tips To Save Time The Ultimate NFL Pick Em Cheat Sheet: Insider Knowledge At Your Fingertips New To Snotel Snow Depth Maps? Start Here For A Beginner's Guide Unlocking Hidden Strengths In Your Natal Chart Compatibility Free Review Colouring Squared Made Easy: A Step-by-Step Guide Discover Insider Basis Independent McLean Calendar Tips Today Emory University Law School Calendar Overview What Do You Need For Brookhaven Special Item Collection Services C5 Form: Unlocking The Power Of Personalized Customer Engagement Dora Verify A License For Your Business Without The Headaches Explore Dora Colorado Attractions For Family Fun Adventures Unlock The Comedy Genius Behind The Classic Werewolf T-Shirt Tear Avoid Costly Fines Brookhaven's Garbage Pickup Rules You Need To Know