Python Opencv Error 215 Size Width 0 Size Height 0 In Function Imshow Information Guide

  1. Introduction on Python Opencv Error 215 Size Width 0 Size Height 0 In Function Imshow
  2. Key Details
  3. Developments
  4. Deep Dive
  5. Conclusion

Introduction on Python Opencv Error 215 Size Width 0 Size Height 0 In Function Imshow

Details PYTHON : OpenCV Error: (-215)size.width 0 && size.height 0 in function imshow Guide
Looking for the latest information on Python Opencv Error 215 Size Width 0 Size Height 0 In Function Imshow? We've compiled comprehensive data, records, and insights about Python Opencv Error 215 Size Width 0 Size Height 0 In Function Imshow.

Key Details

error:(-215:Assertion failed) size.width0 && size.height0 in function 'cv::imshow' SOLVED in opencv News
Explore the primary sources for Python Opencv Error 215 Size Width 0 Size Height 0 In Function Imshow.

Developments

Full 100% resolved imshow | (-215: Assertion Failed) size.width && size.height in function 'cv::imshow' Guide
Stay updated on Python Opencv Error 215 Size Width 0 Size Height 0 In Function Imshow's latest milestones.

error: (-215:Assertion failed) size.width>0 && size.height>0 in function 'cv::imshow' |cv2.error
error: (-215:Assertion failed) size.width>0 && size.height>0 in function 'cv::imshow' |cv2.error
error: (-215:Assertion failed) size.width>0 && size.height>0 in function 'cv::imshow' |cv2.error
error: (-215:Assertion failed) size.width>0 && size.height>0 in function 'cv::imshow' |cv2.error
C++ : OpenCV Error: Assertion failed (size.width 0 && size.height 0) simple code
C++ : OpenCV Error: Assertion failed (size.width 0 && size.height 0) simple code
PYTHON : error: (-215) !empty() in function detectMultiScale
PYTHON : error: (-215) !empty() in function detectMultiScale
OpenCV python get error when use imshow
OpenCV python get error when use imshow
cv2.error: OpenCV(4.5.5) error: (-215:Assertion failed) !_img.empty() in function 'cv::imwrite'
cv2.error: OpenCV(4.5.5) error: (-215:Assertion failed) !_img.empty() in function 'cv::imwrite'
error: (-215:Assertion failed) !_src.empty() in function 'cv::cvtColor' SOLVED in opencv
error: (-215:Assertion failed) !_src.empty() in function 'cv::cvtColor' SOLVED in opencv
Python Opencv imshow error
Python Opencv imshow error
(Solution)cv2.error: error: (-215:Assertion failed) !_src.empty() in function 'cv::cvtColor'
(Solution)cv2.error: error: (-215:Assertion failed) !_src.empty() in function 'cv::cvtColor'
error: (-215:Assertion failed) !empty() in function 'cv::CascadeClassifier::detectMultiScale
error: (-215:Assertion failed) !empty() in function 'cv::CascadeClassifier::detectMultiScale
6.  Display Image using imshow (Advanced Computer Vision using OpenCV Python)
6. Display Image using imshow (Advanced Computer Vision using OpenCV Python)

Deep Dive

Data is compiled from public records and verified media reports.

Last Updated: September 21, 2026

Conclusion

PYTHON : OpenCV resize fails on large image with error: (-215) ssize.area()   0 in function cv::res Guide
For 2026, Python Opencv Error 215 Size Width 0 Size Height 0 In Function Imshow remains one of the most talked-about information profiles. Check back for the latest updates.

Disclaimer: Disclaimer: All information is compiled from publicly available data, media reports, and analysis. Actual details may vary.

Summary

error215Assertionfailedsizewidthgt0sizeheightgt0infunctioncvimshow # Download this code from codegive.com Title: Troubleshooting I am fresher youtuber Sorry for my mistakes. If you have any query here, I will reply you. Thank you. Hi there, welcome to the course of Advanced Computer Vision using

Python Opencv Error 215 Size Width 0 Size Height 0 In Function Imshow.pdf

Size: 3.84 MB · Format: PDF · Secure Download

Download PDF Read Online

Frequently Asked Questions

What is the most accurate information about Python Opencv Error 215 Size Width 0 Size Height 0 In Function Imshow?

Our platform aggregates the most comprehensive and up-to-date insights, ensuring you get relevant details about Python Opencv Error 215 Size Width 0 Size Height 0 In Function Imshow.

Why is Python Opencv Error 215 Size Width 0 Size Height 0 In Function Imshow trending right now?

Interest in Python Opencv Error 215 Size Width 0 Size Height 0 In Function Imshow has surged recently as more people seek reliable resources, related media, and detailed analysis.

Where can I find related media and updates for Python Opencv Error 215 Size Width 0 Size Height 0 In Function Imshow?

You can explore extensive galleries, video summaries, and related content directly on this page.

How often is the content about Python Opencv Error 215 Size Width 0 Size Height 0 In Function Imshow updated?

We regularly update our database with the latest information, media, and analysis related to Python Opencv Error 215 Size Width 0 Size Height 0 In Function Imshow.

Related Documents

Popular Topics

Insider Secrets To Using Gallon Man For Easy Conversions Revolutionize Your HLS Streaming With Intelligent Schedules Galena Park ISD Calendar Overview For Parents And Students Avoid Costly Dental Claim Denials With Free Narrative Techniques Rahab And Spies Sunday School Wake County Court Dates Made Easy With Our Expert Advice The Secret Santa Dilemma: How To Find The Perfect Gift With Our Questionnaire How To Heal Hurt Feelings And Rebuild Self-Esteem Instantly Don't Get Dropped - How To Pass The Air Force PT Test First Time Around Common Mistakes To Avoid When Using Free Contract Templates Online Poker Insights At Borgata Casino Online The Beginner's Guide To Creating And Interpreting An Astrology Chart Memorial Card Design Made Simple With Ready To Use Templates Essential Google Messages For Web Tips For Beginners To Advanced Users Unlock The Power Of Efficient Corporate Compliance In Colorado With Secretary Of State Guidance