React Native Run Android Fail Appincrementaldebugjavacompilationsafeguard Failed Information Guide

  1. Overview on React Native Run Android Fail Appincrementaldebugjavacompilationsafeguard Failed
  2. Important Facts
  3. History
  4. Full Guide
  5. Summary

Overview on React Native Run Android Fail Appincrementaldebugjavacompilationsafeguard Failed

React-Native run-android FAIL! appincrementalDebugJavaCompilationSafeguard FAILED Guide
Looking for the latest information on React Native Run Android Fail Appincrementaldebugjavacompilationsafeguard Failed? We've researched comprehensive data, records, and insights about React Native Run Android Fail Appincrementaldebugjavacompilationsafeguard Failed.

Important Facts

Details How to Fix the Failed to Install App Error in React Native on Android Guide
Explore the main sources for React Native Run Android Fail Appincrementaldebugjavacompilationsafeguard Failed.

History

Full [Fixed] Gradle build failed with unknown error in Expo/React Native News
Stay updated on React Native Run Android Fail Appincrementaldebugjavacompilationsafeguard Failed's newest achievements.

Error Command failed gradlew bat app installDebug  PreactNativeDevServerPort=8081 React Native fixed
Error Command failed gradlew bat app installDebug PreactNativeDevServerPort=8081 React Native fixed
React Native Failed to install the App error, Android emulator not starting or lost connection
React Native Failed to install the App error, Android emulator not starting or lost connection
error message : Task :app:installDebug FAILED | React Native Errors | Fixed!
error message : Task :app:installDebug FAILED | React Native Errors | Fixed!
Fix Gradle Errors in React Native | Step-by-Step Guide
Fix Gradle Errors in React Native | Step-by-Step Guide
Unable to load script - React Native - FIX
Unable to load script - React Native - FIX
Support React Native Android 16KB Page Size | Fix Build Failed Error | NDK
Support React Native Android 16KB Page Size | Fix Build Failed Error | NDK
Use Android Mobile as Emulator in React Native CLI | Run React Native App on Real Android Device
Use Android Mobile as Emulator in React Native CLI | Run React Native App on Real Android Device
STOP Wasting Time on Gradle Errors in React Native! | 100% Resolved Gradle issue in React Native
STOP Wasting Time on Gradle Errors in React Native! | 100% Resolved Gradle issue in React Native
Fixing React Native Android Build Errors by Downgrading the NDK Version
Fixing React Native Android Build Errors by Downgrading the NDK Version
React Native Run Error - Solution (Arch Linux)
React Native Run Error - Solution (Arch Linux)
Error Node JS Server Opens and Closes Quickly After React-Native Run-Android Command
Error Node JS Server Opens and Closes Quickly After React-Native Run-Android Command

Full Guide

Data is compiled from public records and verified media reports.

Last Updated: September 22, 2026

Summary

Full Fixing Gradle build failed Error in React Native with EAS Build for Android Update
For 2026, React Native Run Android Fail Appincrementaldebugjavacompilationsafeguard Failed remains one of the most searched-for information profiles. Check back for the latest updates.

Disclaimer: Disclaimer: All information is compiled from publicly available data, media reports, and analysis. Actual details may vary.

Summary

long story short : open command prompt in the Learn how to resolve the Gradle build Provide an excellent and consistent remedy for "task -app-installDebug" Facing Gradle issues while working with Are you facing the 16 KB page size requirement for In this step-by-step tutorial, you'll learn how to use your Tired of wasting time on Gradle errors in What went wrong: - A problem occurred evaluating project ':app'. - Hello Friends In this tutorial video, I will explain you how to fix Node JS

React Native Run Android Fail Appincrementaldebugjavacompilationsafeguard Failed.pdf

Size: 2.27 MB · Format: PDF · Secure Download

Download PDF Read Online

Frequently Asked Questions

What is the most accurate information about React Native Run Android Fail Appincrementaldebugjavacompilationsafeguard Failed?

Our platform aggregates the most comprehensive and up-to-date insights, ensuring you get relevant details about React Native Run Android Fail Appincrementaldebugjavacompilationsafeguard Failed.

Why is React Native Run Android Fail Appincrementaldebugjavacompilationsafeguard Failed trending right now?

Interest in React Native Run Android Fail Appincrementaldebugjavacompilationsafeguard Failed has surged recently as more people seek reliable resources, related media, and detailed analysis.

Where can I find related media and updates for React Native Run Android Fail Appincrementaldebugjavacompilationsafeguard Failed?

You can explore extensive galleries, video summaries, and related content directly on this page.

How often is the content about React Native Run Android Fail Appincrementaldebugjavacompilationsafeguard Failed updated?

We regularly update our database with the latest information, media, and analysis related to React Native Run Android Fail Appincrementaldebugjavacompilationsafeguard Failed.

Related Documents

Popular Topics

Javascript Course Project Based Learning Flashcard Oop Using Javascript Basic Physics 2 More Acceleration Problems Solved Creating A Ucla Login Pvd Training Clearing Intersections Can Carson Wentz Save The Vikings Season 12 Easy Ways You Can Get Rich In Stardew Valley H 1b To Green Card Dream Faces Fresh Uncertainty Under New Us Immigration Rules World News N18g The Evolution Of Kermit From Muppet To Villain A Study Worship And Serenity At Sri Venkateswara Temple Pittsburgh Boating Safety Best Practices The Wake County Wcpss Traditional Calendar What You Need To Know Now 150 More Validation Part 3 Php Tutorials Millions Being Re Screened For Food Stamps New Snap Ebt Work Requirement Rules Have Begun Joomla 1 5 Beginner Lesson 28 Banners Create A Perfect Seamless Pattern In Affinity Fast Easy Tutorial