Could Not Read Script Node_modulesreact Nativereact Gradle As It Does Not Exist Version 0 72 0 Information Guide

  1. Background on Could Not Read Script Node_modulesreact Nativereact Gradle As It Does Not Exist Version 0 72 0
  2. Main Features
  3. Developments
  4. Full Guide
  5. Future Outlook

Background on Could Not Read Script Node_modulesreact Nativereact Gradle As It Does Not Exist Version 0 72 0

Could not read script 'node_modules\react-native\react.gradle' as it does not exist version 0.72.0 Guide
Looking for the latest information on Could Not Read Script Node_modulesreact Nativereact Gradle As It Does Not Exist Version 0 72 0? We've compiled comprehensive data, records, and insights about Could Not Read Script Node_modulesreact Nativereact Gradle As It Does Not Exist Version 0 72 0.

Main Features

Details Resolving the react-native-gradle-plugin:compileKotlin FAILED Issue by Downgrading Gradle Version Update
Explore the primary sources for Could Not Read Script Node_modulesreact Nativereact Gradle As It Does Not Exist Version 0 72 0.

Developments

Full Fix Gradle Errors in React Native | Step-by-Step Guide Guide
Stay updated on Could Not Read Script Node_modulesreact Nativereact Gradle As It Does Not Exist Version 0 72 0's latest milestones.

How to Fix compileSdkVersion Not Specified Error in React Native Reanimated Setup
How to Fix compileSdkVersion Not Specified Error in React Native Reanimated Setup
How to resolve Gradle Issues in React Native 100% working | React Native Gradle Issue | React
How to resolve Gradle Issues in React Native 100% working | React Native Gradle Issue | React
React Native Errors #1 | Error: spawn ./gradlew EACCES SOLVED!!!
React Native Errors #1 | Error: spawn ./gradlew EACCES SOLVED!!!
Fix Gradle Error in Android Studio | Plugin is not in org.gradle Namespace [SOLVED]
Fix Gradle Error in Android Studio | Plugin is not in org.gradle Namespace [SOLVED]
Solved react native errors ( build , gradle ,compile )
Solved react native errors ( build , gradle ,compile )
Android Studio | Latest Install — Incompatible Gradle JVM Version Error
Android Studio | Latest Install — Incompatible Gradle JVM Version Error
Error Resolving Plugin - id: 'com.facebook.react.settings | React Native CLI Gradle Build Failed
Error Resolving Plugin - id: 'com.facebook.react.settings | React Native CLI Gradle Build Failed
React native android build gradle debuggable false does not turn off __DEV__  (3 answers)
React native android build gradle debuggable false does not turn off __DEV__ (3 answers)
React Native Error : java.io.UncheckedIOException: Could not move temporary workspace 100% Solution
React Native Error : java.io.UncheckedIOException: Could not move temporary workspace 100% Solution
Android : react-native run-android Could not find com.android.tools.build:gradle:3.0.1
Android : react-native run-android Could not find com.android.tools.build:gradle:3.0.1
Unable to load script - React Native - FIX
Unable to load script - React Native - FIX

Full Guide

Data is compiled from public records and verified media reports.

Last Updated: September 21, 2026

Future Outlook

Information Error resolving plugin id react.settings Included build react-native\gradle-plugin' does not exist News
For 2026, Could Not Read Script Node_modulesreact Nativereact Gradle As It Does Not Exist Version 0 72 0 remains one of the most talked-about information profiles. Check back for the newest reports.

Disclaimer: Disclaimer: All information is compiled from publicly available data, media reports, and analysis. Actual details may vary.

Summary

Learn how to fix the `react-native- Error resolving plugin [id: 'com.facebook.react.settings'] Included build node_modules\ Summary: Learn how to resolve the "compileSdkVersion chmod 755 android/gradlew - - - - - - - - - - - - - - - - - - - - - - - - - - - - - - - - - - - - - - Track: Alan Walker - Fade [NCS Release] Music ... In this video, I'll show you how to fix the Hi , This video helps all those mobile developers who After downloading and installing the latest Fix "Error Resolving Plugin [id: 'com.facebook.react.settings']" in React Native! Topmate :- topmate.io/md_alishan_ali Discord:- discord.gg/Wm2zD8Gy Website:- zerodegreecoder.in/ ... Android : react-native run-android

Could Not Read Script Node_modulesreact Nativereact Gradle As It Does Not Exist Version 0 72 0.pdf

Size: 2.96 MB · Format: PDF · Secure Download

Download PDF Read Online

Frequently Asked Questions

What is the most accurate information about Could Not Read Script Node_modulesreact Nativereact Gradle As It Does Not Exist Version 0 72 0?

Our platform aggregates the most comprehensive and up-to-date insights, ensuring you get relevant details about Could Not Read Script Node_modulesreact Nativereact Gradle As It Does Not Exist Version 0 72 0.

Why is Could Not Read Script Node_modulesreact Nativereact Gradle As It Does Not Exist Version 0 72 0 trending right now?

Interest in Could Not Read Script Node_modulesreact Nativereact Gradle As It Does Not Exist Version 0 72 0 has surged recently as more people seek reliable resources, related media, and detailed analysis.

Where can I find related media and updates for Could Not Read Script Node_modulesreact Nativereact Gradle As It Does Not Exist Version 0 72 0?

You can explore extensive galleries, video summaries, and related content directly on this page.

How often is the content about Could Not Read Script Node_modulesreact Nativereact Gradle As It Does Not Exist Version 0 72 0 updated?

We regularly update our database with the latest information, media, and analysis related to Could Not Read Script Node_modulesreact Nativereact Gradle As It Does Not Exist Version 0 72 0.

Related Documents

Popular Topics

Paper Cut Out Elf Designs For Home And Office Cdora License Lookup A Beginners Guide To Understanding Agency Licenses Colorado Real Estate License Search Secrets The Industry Doesnt Want You To Know Scamalot Princess Mina A Reup Get Off The Hook Tips For Reducing Wait Times On The Doc Colorado Locator Site Generator Galore Mod Tutorial Angular 10 Tutorial 13 Components Angular 10 Tutorial For Beginners Pythons Unpacking Operator Is Awesome How To Open An Expresstoll Account Video Explore Mechanical And Aerospace Engineering Lebron James Flop Compilation Dont Overlook These Important Notice Dates On The Cy Fair District Student Calendar Wake County School Board To Consider Moving 2 Schools To Traditional Calendar Ep 114 X C Navigation Log Vfr Cross Country Nav Log Calculations Install Java On Embedded Linux